{"text_format":"1","workbook":"xlsx","n_sheets":32,"sheets":["Home","Dashboard","Gen Tasks","Age Tasks","LifeEvents","Niche Landing","WealthCare","FamilyINC","Executive","SpecialNeeds","Divorcee","NonProfit","Results","Prof Circle","ssestimator","Results Calc","Task Calc","GlidePath","Feedback","Print","MeetingRecap","LEMarriage","LERealEstate","LEFamilyChange","LEOutsideAsset","LEBusinessChange","LEHealthChange","LERetirementChange","LECharitableChange","FamilyTree","Instructions","Release Notes"],"not_rendered":{"charts":17,"images":55,"macros":1,"external_links":0,"defined_names":30,"comments":0,"pivot_tables":1},"unopened":[],"bounds":{"document_bytes":16777216,"sheet_cells":100000,"rows_first":2000,"rows_last":500,"rows_between":2000,"halvings":0,"cell_chars":16384,"cell_head_chars":4096},"cells_cut":0,"cells_raw":0,"read":"whole","date_system":"1900"}

{"sheet":"Home","index":0,"n_rows":28,"n_cols":11,"rows_kept":28,"cut":false,"hidden":false,"merged":[[25,3,26,12]]}
[]
[]
[null,{"$f":"IF(Home!J8=\"\",CONCATENATE(Home!G8,\"'s Plan\"),CONCATENATE(Home!G8, \" & \",Home!J8,\"'s Plan\",\":\"))","v":"'s Plan"}]
[null,"  Financial Life Plan:"]
[null,"  Dashboard"]
[null,"  General Planning",null,null,null,null,"Client",null,null,"Co-Client"]
{"$rows_left_out":23}
{"sheet":"Dashboard","index":1,"n_rows":31,"n_cols":11,"rows_kept":31,"cut":false,"hidden":true,"merged":[]}
[]
[]
[{"$f":"IF(Home!J8=\"\",CONCATENATE(Home!G8,\"'s Plan\"),CONCATENATE(Home!G8, \" & \",Home!J8,\"'s Plan\",\":\"))","v":"'s Plan"}]
["  Financial Life Plan:"]
["  Dashboard"]
["  General Tasks"]
{"$rows_left_out":26}
{"sheet":"Gen Tasks","index":2,"n_rows":28,"n_cols":17,"rows_kept":28,"cut":false,"hidden":false,"merged":[[27,2,28,16],[2,2,2,3],[2,7,2,8],[2,12,2,13],[15,2,15,3],[15,7,15,8],[15,12,15,13]]}
[""]
[]
[{"$f":"Home!B3","v":"'s Plan"},null,"Retirement Planning",null,null,null,null,"Investment Planning",null,null,null,null,"Estate Planning*"]
["  Financial Life Plan:",null,{"$f":"IF(D4=\"\",\"\",IF(F4>(TODAY()-(('Task Calc'!F4*365.25)*0.85)),0,IF(F4>(TODAY()-('Task Calc'!F4*365.25)),2,3)))","v":3},"Goal Planning & Monitoring",null,"2014-05-14",null,{"$f":"IF(I4=\"\",\"\",IF(K4>(TODAY()-(('Task Calc'!J4*365.25)*0.85)),0,IF(K4>(TODAY()-('Task Calc'!J4*365.25)),2,3)))","v":3},"Risk Tolerance Review / GPM",null,"2015-01-06",null,{"$f":"IF(N4=\"\",\"\",IF(P4>(TODAY()-(('Task Calc'!N4*365.25)*0.85)),0,IF(P4>(TODAY()-('Task Calc'!N4*365.25)),2,3)))","v":3},"Trust / Will Review",null,"2011-01-01"]
["  Dashboard",null,{"$f":"IF(D5=\"\",\"\",IF(F5>(TODAY()-(('Task Calc'!F5*365.25)*0.85)),0,IF(F5>(TODAY()-('Task Calc'!F5*365.25)),2,3)))","v":3},"Retirement Income Planning",null,"2015-02-06",null,{"$f":"IF(I5=\"\",\"\",IF(K5>(TODAY()-(('Task Calc'!J5*365.25)*0.85)),0,IF(K5>(TODAY()-('Task Calc'!J5*365.25)),2,3)))","v":3},"Market / Economic Update",null,"2014-03-01",null,{"$f":"IF(N5=\"\",\"\",IF(P5>(TODAY()-(('Task Calc'!N5*365.25)*0.85)),0,IF(P5>(TODAY()-('Task Calc'!N5*365.25)),2,3)))","v":3},"Medical Directives",null,"2014-01-01"]
["  General Planning",null,{"$f":"IF(D6=\"\",\"\",IF(F6>(TODAY()-(('Task Calc'!F6*365.25)*0.85)),0,IF(F6>(TODAY()-('Task Calc'!F6*365.25)),2,3)))","v":3},"Cash Flow Planning",null,"2015-02-06",null,{"$f":"IF(I6=\"\",\"\",IF(K6>(TODAY()-(('Task Calc'!J6*365.25)*0.85)),0,IF(K6>(TODAY()-('Task Calc'!J6*365.25)),2,3)))","v":3},"Asset Allocation ",null,"2015-02-09",null,{"$f":"IF(N6=\"\",\"\",IF(P6>(TODAY()-(('Task Calc'!N6*365.25)*0.85)),0,IF(P6>(TODAY()-('Task Calc'!N6*365.25)),2,3)))","v":3},"Estate Tax Planning",null,"2010-01-01"]
{"$rows_left_out":23}
{"sheet":"Age Tasks","index":3,"n_rows":24,"n_cols":18,"rows_kept":24,"cut":false,"hidden":false,"merged":[[2,2,2,3],[2,7,2,8],[2,12,2,13],[15,2,15,3],[15,7,15,8]]}
[]
[]
[{"$f":"Home!B3","v":"'s Plan"},null,"Under 30",null,null,null,null,"Under 50",null,null,null,null,"50-60"]
["  Financial Life Plan:",null,{"$f":"IF(D4=\"\",\"\",IF(F4>(TODAY()-((G4*365.25)*0.85)),0,IF(F4>(TODAY()-(G4*365.25)),2,3)))","v":0},"Budget Planning - CFF",null,"na",99,{"$f":"IF(I4=\"\",\"\",IF(K4>(TODAY()-((L4*365.25)*0.85)),0,IF(K4>(TODAY()-(L4*365.25)),2,3)))","v":0},"401k/Pension Planning",null,"2014-01-01",99,{"$f":"IF(N4=\"\",\"\",IF(P4>(TODAY()-((Q4*365.25)*0.85)),0,IF(P4>(TODAY()-(Q4*365.25)),2,3)))","v":0},"GlidePath to Retirement",null,"2014-11-19",99,1]
["  Dashboard",null,{"$f":"IF(D5=\"\",\"\",IF(F5>(TODAY()-((G5*365.25)*0.85)),0,IF(F5>(TODAY()-(G5*365.25)),2,3)))","v":0},"Term Life Insurance",null,"na",99,{"$f":"IF(I5=\"\",\"\",IF(K5>(TODAY()-((L5*365.25)*0.85)),0,IF(K5>(TODAY()-(L5*365.25)),2,3)))","v":0},"First Goal Planning & Monitor",null,"2014-01-01",99,{"$f":"IF(N5=\"\",\"\",IF(P5>(TODAY()-((Q5*365.25)*0.85)),0,IF(P5>(TODAY()-(Q5*365.25)),2,3)))","v":0},"50 - 401(k) and IRA Catchup",null,"2014-11-19",99,1]
["  General Planning",null,0,"Student Debt",null,"na",99,0,"Children's Financial Goals",null,"2014-01-01",99,0,"Risk Planning Review",null,"2014-11-19",99,1]
{"$rows_left_out":19}
{"sheet":"LifeEvents","index":4,"n_rows":24,"n_cols":14,"rows_kept":24,"cut":false,"hidden":false,"merged":[[1,4,3,9],[23,3,25,11]]}
[]
[null,null,null,null,"Life Events Planning"]
[{"$f":"Home!B3","v":"'s Plan"}]
["  Financial Life Plan:",null,null,null,null,null,null,null,null,null,null,null,null,99]
["  Dashboard"]
["  General Planning",null,null,null,null,null,null,null,null,null,null,null,null,99]
{"$rows_left_out":19}
{"sheet":"Niche Landing","index":5,"n_rows":16,"n_cols":1,"rows_kept":16,"cut":false,"hidden":false,"merged":[[5,4,6,4],[7,4,8,4],[5,6,6,6],[9,4,10,4],[11,4,12,4],[13,4,14,4],[7,6,8,6],[9,6,10,6],[11,6,12,6],[13,6,14,6]]}
[]
[]
[{"$f":"Home!B3","v":"'s Plan"}]
["  Financial Life Plan:"]
["  Dashboard"]
["  General Planning"]
{"$rows_left_out":11}
{"sheet":"WealthCare","index":6,"n_rows":20,"n_cols":14,"rows_kept":20,"cut":false,"hidden":false,"merged":[[4,10,4,12],[4,6,4,8],[4,2,4,4],[1,4,3,9]]}
[]
[null,null,null,null,"Physician Planning"]
[{"$f":"Home!B3","v":"'s Plan"}]
["  Financial Life Plan:",null,null,null,null,null,null,null,null,null,null,null,null,99]
["  Dashboard",null,"Early Years",null,null,null,"Late Stage",null,null,null,"Succession Planning"]
["  General Planning",null,{"$f":"IF(D6=\"\",\"\",IF(E6>(TODAY()-((F6*365.25)*0.85)),0,IF(E6>(TODAY()-(F6*365.25)),2,3)))","v":3},"Medical School Debt",null,1,{"$f":"IF(H6=\"\",\"\",IF(I6>(TODAY()-((J6*365.25)*0.85)),0,IF(I6>(TODAY()-(J6*365.25)),2,3)))","v":""},null,null,99,{"$f":"IF(L6=\"\",\"\",IF(M6>(TODAY()-((N6*365.25)*0.85)),0,IF(M6>(TODAY()-(N6*365.25)),2,3)))","v":3},"Business Management",null,99]
{"$rows_left_out":15}
{"sheet":"FamilyINC","index":7,"n_rows":20,"n_cols":14,"rows_kept":20,"cut":false,"hidden":false,"merged":[[1,4,3,9],[4,2,4,4],[4,6,4,8],[4,10,4,12]]}
[]
[null,null,null,null,"Small Business Planning"]
[{"$f":"Home!B3","v":"'s Plan"}]
["  Financial Life Plan:",null,null,null,null,null,null,null,null,null,null,null,null,99]
["  Dashboard",null,"Personal Planning",null,null,null,"Business Planning",null,null,null,"Succession / Transition Planning"]
["  General Planning",null,{"$f":"IF(D6=\"\",\"\",IF(E6>(TODAY()-((F6*365.25)*0.85)),0,IF(E6>(TODAY()-(F6*365.25)),2,3)))","v":3},"Buy Sell Agreementrs",null,99,{"$f":"IF(H6=\"\",\"\",IF(I6>(TODAY()-((J6*365.25)*0.85)),0,IF(I6>(TODAY()-(J6*365.25)),2,3)))","v":3},"Financial Planning Overview",null,99,{"$f":"IF(L6=\"\",\"\",IF(M6>(TODAY()-((N6*365.25)*0.85)),0,IF(M6>(TODAY()-(N6*365.25)),2,3)))","v":3},"Family or Outside buyer",null,99]
{"$rows_left_out":15}
{"sheet":"Executive","index":8,"n_rows":16,"n_cols":14,"rows_kept":16,"cut":false,"hidden":false,"merged":[[1,4,3,9],[4,2,4,4],[4,6,4,8],[4,10,4,12]]}
[]
[null,null,null,null,"Executive Planning"]
[{"$f":"Home!B3","v":"'s Plan"}]
["  Financial Life Plan:",null,null,null,null,null,null,null,null,null,null,null,null,99]
["  Dashboard",null,"Executive Retirement Plans",null,null,null,"Concentration Review",null,null,null,"Succession Planning"]
["  General Planning",null,{"$f":"IF(D6=\"\",\"\",IF(E6>(TODAY()-((F6*365.25)*0.85)),0,IF(E6>(TODAY()-(F6*365.25)),2,3)))","v":3},"Deferred Compensation Review",null,99,{"$f":"IF(H6=\"\",\"\",IF(I6>(TODAY()-((J6*365.25)*0.85)),0,IF(I6>(TODAY()-(J6*365.25)),2,3)))","v":3},"Restricted Stock",null,99,{"$f":"IF(L6=\"\",\"\",IF(M6>(TODAY()-((N6*365.25)*0.85)),0,IF(M6>(TODAY()-(N6*365.25)),2,3)))","v":""},null,null,99]
{"$rows_left_out":11}
{"sheet":"SpecialNeeds","index":9,"n_rows":20,"n_cols":14,"rows_kept":20,"cut":false,"hidden":false,"merged":[[1,4,3,9],[4,2,4,4],[4,6,4,8]]}
[]
[null,null,null,null,"Special Needs Planning"]
[{"$f":"Home!B3","v":"'s Plan"}]
["  Financial Life Plan:",null,null,null,null,null,null,null,null,null,null,null,null,99]
["  Dashboard",null,"Special Needs Trust",null,null,null,"Other Planning"]
["  General Planning",null,{"$f":"IF(D6=\"\",\"\",IF(E6>(TODAY()-((F6*365.25)*0.85)),0,IF(E6>(TODAY()-(F6*365.25)),2,3)))","v":3},"Third-Party Trust",null,99,{"$f":"IF(H6=\"\",\"\",IF(I6>(TODAY()-((J6*365.25)*0.85)),0,IF(I6>(TODAY()-(J6*365.25)),2,3)))","v":3},"Beneficiary Designations",null,99,null,null,null,99]
{"$rows_left_out":15}
{"sheet":"Divorcee","index":10,"n_rows":20,"n_cols":14,"rows_kept":20,"cut":false,"hidden":false,"merged":[[1,4,3,9],[4,2,4,4],[4,6,4,8]]}
[]
[null,null,null,null,"Divorcee Planning"]
[{"$f":"Home!B3","v":"'s Plan"}]
["  Financial Life Plan:",null,null,null,null,null,null,null,null,null,null,null,null,99]
["  Dashboard",null,"Financial Planning",null,null,null,"Other Planning"]
["  General Planning",null,{"$f":"IF(D6=\"\",\"\",IF(E6>(TODAY()-((F6*365.25)*0.85)),0,IF(E6>(TODAY()-(F6*365.25)),2,3)))","v":3},"Assess Spouse Income",null,99,{"$f":"IF(H6=\"\",\"\",IF(I6>(TODAY()-((J6*365.25)*0.85)),0,IF(I6>(TODAY()-(J6*365.25)),2,3)))","v":3},"Update Wills and Trusts",null,99,null,null,null,99]
{"$rows_left_out":15}
{"sheet":"NonProfit","index":11,"n_rows":20,"n_cols":14,"rows_kept":20,"cut":false,"hidden":false,"merged":[[1,4,3,9],[4,2,4,4],[4,6,4,8]]}
[]
[null,null,null,null,"Non - Profit Planning"]
[{"$f":"Home!B3","v":"'s Plan"}]
["  Financial Life Plan:",null,null,null,null,null,null,null,null,null,null,null,null,99]
["  Dashboard",null,"Asset Management",null,null,null,"Other Planning"]
["  General Planning",null,{"$f":"IF(D6=\"\",\"\",IF(E6>(TODAY()-((F6*365.25)*0.85)),0,IF(E6>(TODAY()-(F6*365.25)),2,3)))","v":3},"Request for Proposal",null,99,{"$f":"IF(H6=\"\",\"\",IF(I6>(TODAY()-((J6*365.25)*0.85)),0,IF(I6>(TODAY()-(J6*365.25)),2,3)))","v":""},null,null,99,null,null,null,99]
{"$rows_left_out":15}
{"sheet":"Results","index":12,"n_rows":16,"n_cols":4,"rows_kept":16,"cut":false,"hidden":false,"merged":[]}
[]
[]
[{"$f":"Home!B3","v":"'s Plan"}]
["  Financial Life Plan:"]
["  Dashboard",null,null,"Overall Completion"]
["  General Planning"]
{"$rows_left_out":11}
{"sheet":"Prof Circle","index":13,"n_rows":19,"n_cols":16,"rows_kept":19,"cut":false,"hidden":false,"merged":[[5,11,5,12],[11,14,11,15],[16,3,17,3],[10,6,11,6],[10,12,11,12],[16,15,17,15],[3,8,3,9],[8,8,9,8],[8,9,9,9],[5,5,5,6],[11,2,11,3]]}
[]
[]
[{"$f":"Home!B3","v":"'s Plan"}]
["  Financial Life Plan:",null,null,null,null,null,null,null,"Estate Attorney"]
["  Dashboard",null,null,null,null,null,null,null,"Name:"]
["  General Planning",null,null,null,null,"Attorney",null,null,"Firm:",null,null,"Other"]
{"$rows_left_out":14}
{"sheet":"ssestimator","index":14,"n_rows":16,"n_cols":14,"rows_kept":16,"cut":false,"hidden":false,"merged":[[1,4,3,9]]}
[]
[null,null,null,null,"Social Security Estimator"]
[{"$f":"Home!B3","v":"'s Plan"}]
["  Financial Life Plan:",null,null,null,null,null,null,null,null,null,null,null,null,99]
["  Dashboard"]
["  General Planning"]
{"$rows_left_out":11}
{"sheet":"Results Calc","index":15,"n_rows":86,"n_cols":22,"rows_kept":86,"cut":false,"hidden":false,"merged":[[1,1,1,5],[1,7,1,11],[1,13,1,17],[12,1,12,5],[12,7,12,11],[12,13,12,17],[25,2,25,6],[35,2,35,6],[25,9,25,13],[25,16,25,20],[35,9,35,13],[35,16,35,20]]}
[]
[null,"Retirement Planning",null,null,null,null,null,"Investment Planning",null,null,null,null,null,"Estate Planning"]
[null,null,null,{"$f":"COUNTIF('Gen Tasks'!C$4:C$11,0)-(COUNTIF('Gen Tasks'!F4:F11,\"na\"))","v":0},"Green",{"$f":"(((D3+D4)/D6)*0.75)*100","v":12.5},null,null,null,{"$f":"COUNTIF('Gen Tasks'!H4:H11,0)-(COUNTIF('Gen Tasks'!K4:K11,\"na\"))","v":0},"Green",{"$f":"(((J3+J4)/J6)*0.75)*100","v":0},null,null,null,{"$f":"COUNTIF('Gen Tasks'!M4:M11,0)-(COUNTIF('Gen Tasks'!P4:P11,\"na\"))","v":0},"Green",{"$f":"(((P3+P4)/P6)*0.75)*100","v":0},null,null,null,"na"]
[null,null,null,{"$f":"COUNTIF('Gen Tasks'!C$4:C$11,2)","v":1},"Yellow",0,null,null,null,{"$f":"COUNTIF('Gen Tasks'!H4:H11,2)","v":0},"Yellow",0,null,null,null,{"$f":"COUNTIF('Gen Tasks'!M4:M11,2)","v":0},"Yellow",0,null,null,null,{"$f":"TODAY()","v":"2019-07-08"}]
[null,null,null,{"$f":"COUNTIF('Gen Tasks'!C$4:C$11,3)","v":5},"Red",{"$f":"((D5/D$6)*0.75)*100","v":62.5},null,null,null,{"$f":"COUNTIF('Gen Tasks'!H4:H11,3)","v":7},"Red",{"$f":"((J5/J$6)*0.75)*100","v":75},null,null,null,{"$f":"COUNTIF('Gen Tasks'!M4:M11,3)","v":6},"Red",{"$f":"((P5/P$6)*0.75)*100","v":75}]
[null,null,null,{"$f":"COUNT('Gen Tasks'!C4:C11)-(COUNTIF('Gen Tasks'!F4:F11,\"na\"))","v":6},"white",25,null,null,null,{"$f":"COUNT('Gen Tasks'!H4:H11)-(COUNTIF('Gen Tasks'!K4:K11,\"na\"))","v":7},"white",25,null,null,null,{"$f":"COUNT('Gen Tasks'!M4:M11)-(COUNTIF('Gen Tasks'!P4:P11,\"na\"))","v":6},"white",25]
{"$rows_left_out":81}
{"sheet":"Task Calc","index":16,"n_rows":23,"n_cols":14,"rows_kept":23,"cut":false,"hidden":false,"merged":[[2,3,2,4]]}
[]
[]
[{"$f":"Home!B3","v":"'s Plan"},null,null,{"$f":"'Gen Tasks'!C3","v":"Retirement Planning"},null,null,null,{"$f":"'Gen Tasks'!H3","v":"Investment Planning"},null,null,null,{"$f":"'Gen Tasks'!M3","v":"Estate Planning*"}]
["  Financial Life Plan:",null,null,{"$f":"IF(ISBLANK('Gen Tasks'!D4),\"\",'Gen Tasks'!D4)","v":"Goal Planning & Monitoring"},null,1,null,{"$f":"IF(ISBLANK('Gen Tasks'!I4),\"\",'Gen Tasks'!I4)","v":"Risk Tolerance Review / GPM"},null,1,null,{"$f":"IF(ISBLANK('Gen Tasks'!N4),\"\",'Gen Tasks'!N4)","v":"Trust / Will Review"},null,5]
["  Dashboard",null,null,{"$f":"IF(ISBLANK('Gen Tasks'!D5),\"\",'Gen Tasks'!D5)","v":"Retirement Income Planning"},null,3,null,{"$f":"IF(ISBLANK('Gen Tasks'!I5),\"\",'Gen Tasks'!I5)","v":"Market / Economic Update"},null,1,null,{"$f":"IF(ISBLANK('Gen Tasks'!N5),\"\",'Gen Tasks'!N5)","v":"Medical Directives"},null,5]
["  General Planning",null,null,{"$f":"IF(ISBLANK('Gen Tasks'!D6),\"\",'Gen Tasks'!D6)","v":"Cash Flow Planning"},null,3,null,{"$f":"IF(ISBLANK('Gen Tasks'!I6),\"\",'Gen Tasks'!I6)","v":"Asset Allocation "},null,0.5,null,{"$f":"IF(ISBLANK('Gen Tasks'!N6),\"\",'Gen Tasks'!N6)","v":"Estate Tax Planning"},null,5]
{"$rows_left_out":18}
{"sheet":"GlidePath","index":17,"n_rows":59,"n_cols":12,"rows_kept":59,"cut":false,"hidden":false,"merged":[[50,4,50,8],[1,3,3,8],[4,10,5,12],[4,2,4,4],[4,6,4,8],[18,2,18,4],[18,6,18,8],[36,7,36,11]]}
[]
[null,null,null,"GlidePath to Retirement"]
[{"$f":"Home!B3","v":"'s Plan"}]
["  Financial Life Plan:"]
["  Dashboard",null,"Financial",null,null,null,"Healthcare",null,null,null,"GlidePath to Retirement Completion"]
["  General Planning",null,{"$f":"IF(D6=\"\",\"\",IF(E6>(TODAY()-((F6*365.25)*0.85)),0,IF(E6>(TODAY()-(F6*365.25)),2,3)))","v":0},"Pre- Retirement Risk Assessment","2014-08-11",99,{"$f":"IF(H6=\"\",\"\",IF(I6>(TODAY()-((J6*365.25)*0.85)),0,IF(I6>(TODAY()-(J6*365.25)),2,3)))","v":0},"Healthcare Cost Assessment","2014-08-11",99]
{"$rows_left_out":54}
{"sheet":"Feedback","index":18,"n_rows":55,"n_cols":7,"rows_kept":55,"cut":false,"hidden":false,"merged":[[1,3,3,10]]}
[]
[null,null,null,"Feedback"]
[{"$f":"Home!B3","v":"'s Plan"}]
["  Financial Life Plan:"]
["  Dashboard"]
["  General Planning"]
{"$rows_left_out":50}
{"sheet":"Print","index":19,"n_rows":64,"n_cols":3,"rows_kept":64,"cut":false,"hidden":false,"merged":[[3,2,3,4]]}
[]
[]
[]
[null,null,{"$f":"IF(Home!J8=\"\",CONCATENATE(Home!G8,\"'s\"),CONCATENATE(Home!G8,\" & \",Home!J8,\"'s \"))","v":"'s"}]
[]
[]
{"$rows_left_out":59}
{"sheet":"MeetingRecap","index":20,"n_rows":97,"n_cols":13,"rows_kept":97,"cut":false,"hidden":false,"merged":[[10,12,13,15]]}
[]
[]
[]
[]
[null,null,{"$f":"TODAY()","v":"2019-07-08"},null,null,null,"Meeting Recap*"]
[null,null,null,null,null,null,"Date","2015-02-10"]
{"$rows_left_out":92}
{"sheet":"LEMarriage","index":21,"n_rows":16,"n_cols":13,"rows_kept":16,"cut":false,"hidden":false,"merged":[[4,10,5,11],[1,4,3,9],[4,3,5,3],[4,6,5,7]]}
[]
[null,null,null,null,"Marital Status Change"]
[{"$f":"Home!B3","v":"'s Plan"}]
["  Financial Life Plan:"]
["  Dashboard",null,null,"Pre Marriage",null,null,"Divorce",null,null,null,"Widowed"]
["  General Planning"]
{"$rows_left_out":11}
{"sheet":"LERealEstate","index":22,"n_rows":17,"n_cols":14,"rows_kept":17,"cut":false,"hidden":false,"merged":[[1,4,3,9],[4,2,5,3],[4,6,5,7],[4,10,5,11]]}
[]
[null,null,null,null,"Real Estate Change"]
[{"$f":"Home!B3","v":"'s Plan"}]
["  Financial Life Plan:",null,null,null,null,null,null,null,null,null,null,null,null,99]
["  Dashboard",null,"Buying",null,null,null,"Selling",null,null,null,"Mortgage / Refinance"]
["  General Planning"]
{"$rows_left_out":12}
{"sheet":"LEFamilyChange","index":23,"n_rows":16,"n_cols":14,"rows_kept":16,"cut":false,"hidden":false,"merged":[[1,4,3,9]]}
[]
[null,null,null,null,"Family Life Changes"]
[{"$f":"Home!B3","v":"'s Plan"}]
["  Financial Life Plan:",null,null,null,null,null,null,null,null,null,null,null,null,99]
["  Dashboard"]
["  General Planning",null,null,"Having a Baby",null,null,null,"Adopting",null,null,null,"Grandchild"]
{"$rows_left_out":11}
{"sheet":"LEOutsideAsset","index":24,"n_rows":16,"n_cols":11,"rows_kept":16,"cut":false,"hidden":false,"merged":[[1,4,3,9],[4,3,5,3],[4,6,5,7],[4,10,5,11]]}
[]
[null,null,null,null,"Outside Asset Change"]
[{"$f":"Home!B3","v":"'s Plan"}]
["  Financial Life Plan:"]
["  Dashboard",null,null,"Employer Plans",null,null,"Employee Plans",null,null,null,"Other"]
["  General Planning"]
{"$rows_left_out":11}
{"sheet":"LEBusinessChange","index":25,"n_rows":16,"n_cols":11,"rows_kept":16,"cut":false,"hidden":false,"merged":[[1,4,3,9],[4,3,5,3],[4,6,5,7],[4,10,5,11]]}
[]
[null,null,null,null,"Major Business Change"]
[{"$f":"Home!B3","v":"'s Plan"}]
["  Financial Life Plan:"]
["  Dashboard",null,null,"New / Leaving Job ",null,null,"Pre-Business Sale",null,null,null,"Post-Business Sale"]
["  General Planning"]
{"$rows_left_out":11}
{"sheet":"LEHealthChange","index":26,"n_rows":16,"n_cols":12,"rows_kept":16,"cut":false,"hidden":false,"merged":[[1,4,3,9],[4,3,5,3],[4,6,5,7],[4,10,5,11]]}
[]
[null,null,null,null,"Health Status Change"]
[{"$f":"Home!B3","v":"'s Plan"}]
["  Financial Life Plan:"]
["  Dashboard",null,null,"Health Planning",null,null,"Catastophic",null,null,null,"Assisted Living"]
["  General Planning"]
{"$rows_left_out":11}
{"sheet":"LERetirementChange","index":27,"n_rows":16,"n_cols":12,"rows_kept":16,"cut":false,"hidden":false,"merged":[[1,4,3,9],[4,3,5,3],[4,6,5,7],[4,10,5,11]]}
[]
[null,null,null,null,"Retirement Plan Change"]
[{"$f":"Home!B3","v":"'s Plan"}]
["  Financial Life Plan:"]
["  Dashboard",null,null,"Nearing Retirement",null,null,"Thriving in Retirement",null,null,null,"Other"]
["  General Planning"]
{"$rows_left_out":11}
{"sheet":"LECharitableChange","index":28,"n_rows":16,"n_cols":12,"rows_kept":16,"cut":false,"hidden":false,"merged":[[1,4,3,9],[4,6,5,7],[4,10,5,11],[4,3,5,4]]}
[]
[null,null,null,null,"Charitable Intent Change"]
[{"$f":"Home!B3","v":"'s Plan"}]
["  Financial Life Plan:"]
["  Dashboard",null,null,"RJ Resources",null,null,"Brochures",null,null,null,"Case Studies"]
["  General Planning"]
{"$rows_left_out":11}
{"sheet":"FamilyTree","index":29,"n_rows":16,"n_cols":14,"rows_kept":16,"cut":false,"hidden":false,"merged":[[1,4,3,9]]}
[]
[null,null,null,null,"Family Tree"]
[{"$f":"Home!B3","v":"'s Plan"}]
["  Financial Life Plan:",null,null,null,null,null,null,null,null,null,null,null,null,99]
["  Dashboard"]
["  General Planning"]
{"$rows_left_out":11}
{"sheet":"Instructions","index":30,"n_rows":55,"n_cols":7,"rows_kept":55,"cut":false,"hidden":false,"merged":[[1,3,3,10]]}
[]
[null,null,null,"Instructions"]
[{"$f":"Home!B3","v":"'s Plan"}]
["  Financial Life Plan:"]
["  Dashboard"]
["  General Planning"]
{"$rows_left_out":50}
{"sheet":"Release Notes","index":31,"n_rows":55,"n_cols":7,"rows_kept":55,"cut":false,"hidden":false,"merged":[[1,3,3,10]]}
[]
[null,null,null,"Release Notes"]
[{"$f":"Home!B3","v":"'s Plan"}]
["  Financial Life Plan:"]
["  Dashboard"]
["  General Planning"]
{"$rows_left_out":49}